Target
Cytochrome P450 11B2, mitochondrial
Ligand
BDBM232945
Substrate
Meas. Tech.
HTRF-Based Assay
IC50
102±n/a nM
Citation
 Bennett, DJCai, JCarswell, ECooke, AHoyt, SBLondon, CMacLean, JPark, MKRatcliffe, PXiong, YSamanta, SKKulkarni, BA Pyrazolopyridyl compounds as aldosterone synthase inhibitors US Patent  US9844553 Publication Date 12/19/2017 
Target
Name:
Cytochrome P450 11B2, mitochondrial
Synonyms:
Aldosterone Synthase (CYP11B2) Aldosterone-synthesizing enzyme CYP11B2 Cytochrome P450 11B2 Cytochrome P450 11B2, mitochondrial P-450C18 | Steroid 18-hydroxylase
Type:
Protein
Mol. Mass.:
57582.15
Organism:
Homo sapiens (Human)
Description:
P19099
Residue:
503
  
Inhibitor
Name:
BDBM232945
Synonyms:
US9351973, 19 | US9844553, 19
Type:
Small organic molecule
Emp. Form.:
C14H13FN4O
Mol. Mass.:
272.2776
SMILES:
Fc1cncc(c1)-c1nn2CCC(=O)Nc2c1C1CC1
: