Target
Procathepsin L
Ligand
BDBM19741
Substrate
BDBM19485
Meas. Tech.
Enzyme Inhibition Assay
pH
5.5±n/a
Temperature
295.15±n/a K
IC50
0.33±n/a nM
Km
850±n/a nM
Citation
 Altmann, EAichholz, RBetschart, CBuhl, TGreen, JIrie, OTeno, NLattmann, RTintelnot-Blomley, MMissbach, M 2-Cyano-pyrimidines: a new chemotype for inhibitors of the cysteine protease cathepsin K. J Med Chem 50:591-4 (2007)  
Target
Name:
Procathepsin L
Synonyms:
CATL1_HUMAN CTSL CTSL1 Cathepsin L Cathepsin L1 heavy chain MEP cathepsin L preproprotein
Type:
Enzyme
Mol. Mass.:
37557.19
Organism:
Homo sapiens (Human)
Description:
Purchased from Calbiochem (San Diego, CA).
Residue:
333
  
Inhibitor
Name:
BDBM19741
Synonyms:
2-Cyano-pyrimidine, 17f | 2-cyano-4-[(2,2-dimethylpropyl)amino]-N-(2-{4-[(4-methylpiperazin-1-yl)methyl]phenyl}ethyl)pyrimidine-5-carboxamide
Type:
Small organic molecule
Emp. Form.:
C25H35N7O
Mol. Mass.:
449.5917
SMILES:
CN1CCN(Cc2ccc(CCNC(=O)c3cnc(nc3NCC(C)(C)C)C#N)cc2)CC1
:
Substrate
Name:
BDBM19485
Synonyms:
Cbz-Phe-Arg-AMC Z-Phe-Arg-AMC.HCl
Type:
Emp. Form.:
Mol. Mass.:
SMILES:
: