Target
Cathepsin S
Ligand
BDBM19742
Substrate
BDBM19963
Meas. Tech.
Enzyme Inhibition Assay
IC50
10±n/a nM
Citation
 Altmann, EAichholz, RBetschart, CBuhl, TGreen, JIrie, OTeno, NLattmann, RTintelnot-Blomley, MMissbach, M 2-Cyano-pyrimidines: a new chemotype for inhibitors of the cysteine protease cathepsin K. J Med Chem 50:591-4 (2007)  
Target
Name:
Cathepsin S
Synonyms:
CATS_HUMAN Cathepsin S (Cat S) | cathepsin S preproprotein
Type:
Protein
Mol. Mass.:
37507.38
Organism:
Homo sapiens (Human)
Description:
P25774
Residue:
331
  
Inhibitor
Name:
BDBM19742
Synonyms:
2-Cyano-pyrimidine, 17g | 2-cyano-4-[(2,2-dimethylpropyl)amino]-N-(2-{4-[(1-methylpiperidin-4-yl)oxy]phenyl}ethyl)pyrimidine-5-carboxamide
Type:
Small organic molecule
Emp. Form.:
C25H34N6O2
Mol. Mass.:
450.5765
SMILES:
CN1CCC(CC1)Oc1ccc(CCNC(=O)c2cnc(nc2NCC(C)(C)C)C#N)cc1
:
Substrate
Name:
BDBM19963
Synonyms:
Cbz-Leu-Leu-Arg-AMC Z-Leu-Leu-Arg-AMC
Type:
Emp. Form.:
Mol. Mass.:
SMILES:
: