Target
Nuclear receptor ROR-gamma
Ligand
BDBM362888
Substrate
Meas. Tech.
Binding Assay
Ki
<100±n/a nM
Citation
 Claremon, DADillard, LWDong, CFan, YJia, LLotesta, SDMarcus, ASingh, SBTice, CMYuan, JZhao, WZheng, YZhuang, L Isoindoline inhibitors of ROR-gamma US Patent  US9845308 Publication Date 12/19/2017 
Target
Name:
Nuclear receptor ROR-gamma
Synonyms:
NR1F3 Nuclear receptor ROR-gamma (RORC) RAR-related orphan receptor C (RORc) RORG RZRG Retinoid-related orphan receptor-gamma (RORc)
Type:
Enzyme Catalytic Domain
Mol. Mass.:
58218.40
Organism:
Homo sapiens (Human)
Description:
P51449
Residue:
518
  
Inhibitor
Name:
BDBM362888
Synonyms:
US9845308, Example 12c
Type:
Small organic molecule
Emp. Form.:
C29H37F3N2O4S
Mol. Mass.:
566.675
SMILES:
CCS(=O)(=O)c1ccc(CNC(=O)c2ccc3[C@@H](C(C)C)N(CC4CC[C@](O)(CC4)C(F)(F)F)Cc3c2)cc1
: