Target
Cathepsin S
Ligand
BDBM19764
Substrate
BDBM19963
Meas. Tech.
Enzyme Inhibition Assay
IC50
29±n/a nM
Citation
 Altmann, EAichholz, RBetschart, CBuhl, TGreen, JLattmann, RMissbach, M Dipeptide nitrile inhibitors of cathepsin K. Bioorg Med Chem Lett 16:2549-54 (2006)  
Target
Name:
Cathepsin S
Synonyms:
CATS_HUMAN Cathepsin S (Cat S) | cathepsin S preproprotein
Type:
Protein
Mol. Mass.:
37507.38
Organism:
Homo sapiens (Human)
Description:
P25774
Residue:
331
  
Inhibitor
Name:
BDBM19764
Synonyms:
(2S)-N-[(1R)-2-(benzyloxy)-1-cyanoethyl]-2-(1H-indol-2-ylformamido)-4-methylpentanamide | dipeptidyl nitrile, 16e
Type:
Small organic molecule
Emp. Form.:
C25H28N4O3
Mol. Mass.:
432.5148
SMILES:
CC(C)C[C@H](NC(=O)c1cc2ccccc2[nH]1)C(=O)N[C@@H](COCc1ccccc1)C#N
:
Substrate
Name:
BDBM19963
Synonyms:
Cbz-Leu-Leu-Arg-AMC Z-Leu-Leu-Arg-AMC
Type:
Emp. Form.:
Mol. Mass.:
SMILES:
: