Target
Apelin receptor
Ligand
BDBM269592
Substrate
Meas. Tech.
[35S]GTPγS Binding
EC50
15.0±n/a nM
Citation
 Chen, NChen, XCheng, ACConnors, RVDeignan, JDransfield, PJDu, XFu, ZHeath, JAHorne, DBHouze, JKaller, MRKopecky, DJLai, SMa, ZMcGee, LRMedina, JCMihalic, JTNishimura, NOlson, SHPattaropong, VWang, XYang, KDebenedetto, MVHedley, SJ Intermediates for preparing triazole agonists of the APJ receptor US Patent  US9845310 Publication Date 12/19/2017 
Target
Name:
Apelin receptor
Synonyms:
AGTRL1 APJ_HUMAN Angiotensin receptor-like 1 Apelin receptor (APJ) G-protein coupled receptor HG11
Type:
Enzyme Catalytic Domain
Mol. Mass.:
42664.06
Organism:
Homo sapiens (Human)
Description:
P35414
Residue:
380
  
Inhibitor
Name:
BDBM269592
Synonyms:
(1S,2R)-N-(4-(2,6-dimethoxyphenyl)-5-(6-methoxy-2-pyridinyl)-4H-1,2,4-triazol-3-yl)-1-ethoxy-1-(5-methyl-2-pyrimidinyl)-2-propanesulfonamide, (1R,2S)-N-(4-(2,6-dimethoxyphenyl)-5-(6-methoxy-2-pyridinyl)-4H-1,2,4-triazol-3-yl)-1-ethoxy-1-(5-methyl-2-pyrimidinyl)-2-propanesulfonamide US10058550, Example 107.0 US9845310, Example 107.0
Type:
Small organic molecule
Emp. Form.:
C26H31N7O6S
Mol. Mass.:
569.633
SMILES:
CCO[C@H]([C@@H](C)S(=O)(=O)Nc1nnc(-c2cccc(OC)n2)n1-c1c(OC)cccc1OC)c1ncc(C)cn1
: