Target
Sodium channel protein type 9 subunit alpha
Ligand
BDBM258102
Substrate
Meas. Tech.
Electrophysiological Assay
IC50
12.0±n/a nM
Citation
 Shinozuka, TKobayashi, HSuzuki, STanaka, KKimoto, HDomon, Y Cycloalkane derivatives US Patent  US9845313 Publication Date 12/19/2017 
Target
Name:
Sodium channel protein type 9 subunit alpha
Synonyms:
NENA Peripheral sodium channel 1 SCN9A_HUMAN Voltage-gated sodium channel subunit Nav1.7 hNE-Na
Type:
Protein
Mol. Mass.:
226375.97
Organism:
Homo sapiens (Human)
Description:
Q15858
Residue:
1988
  
Inhibitor
Name:
BDBM258102
Synonyms:
US9493448, 4 | US9845313, Example 4
Type:
Small organic molecule
Emp. Form.:
C18H19F2N5O3S2
Mol. Mass.:
455.502
SMILES:
Cn1nccc1[C@H]1CCCC[C@@H]1Oc1cc(F)c(cc1F)S(=O)(=O)Nc1ncns1
: