Target
Sodium channel protein type 9 subunit alpha
Ligand
BDBM258136
Substrate
Meas. Tech.
Electrophysiological Assay
IC50
240±n/a nM
Citation
 Shinozuka, TKobayashi, HSuzuki, STanaka, KKimoto, HDomon, Y Cycloalkane derivatives US Patent  US9845313 Publication Date 12/19/2017 
Target
Name:
Sodium channel protein type 9 subunit alpha
Synonyms:
NENA Peripheral sodium channel 1 SCN9A_HUMAN Voltage-gated sodium channel subunit Nav1.7 hNE-Na
Type:
Protein
Mol. Mass.:
226375.97
Organism:
Homo sapiens (Human)
Description:
Q15858
Residue:
1988
  
Inhibitor
Name:
BDBM258136
Synonyms:
US9493448, 119 US9493448, 95 US9845313, Example 119
Type:
Small organic molecule
Emp. Form.:
C20H21F2N5O3S
Mol. Mass.:
449.474
SMILES:
CCn1nccc1[C@H]1CCC[C@@H]1Oc1ccc(c(F)c1F)S(=O)(=O)Nc1ccncn1
: