Target
Sodium channel protein type 9 subunit alpha
Ligand
BDBM258241
Substrate
Meas. Tech.
Electrophysiological Assay
IC50
32000±n/a nM
Citation
 Shinozuka, TKobayashi, HSuzuki, STanaka, KKimoto, HDomon, Y Cycloalkane derivatives US Patent  US9845313 Publication Date 12/19/2017 
Target
Name:
Sodium channel protein type 9 subunit alpha
Synonyms:
NENA Peripheral sodium channel 1 SCN9A_HUMAN Voltage-gated sodium channel subunit Nav1.7 hNE-Na
Type:
Protein
Mol. Mass.:
226375.97
Organism:
Homo sapiens (Human)
Description:
Q15858
Residue:
1988
  
Inhibitor
Name:
BDBM258241
Synonyms:
US9493448, 149 | US9845313, Example 149
Type:
Small organic molecule
Emp. Form.:
C19H20FN5O3S
Mol. Mass.:
417.457
SMILES:
Cc1cc(c(F)cc1O[C@@H]1CCC[C@H]1c1ccn[nH]1)S(=O)(=O)Nc1ccncn1
: