Target
ALK tyrosine kinase receptor [L1196M]
Ligand
BDBM243400
Substrate
IC50
<10.00±n/a nM
Citation
 Yun, CSKim, HRCho, SYJung, HJLee, KChae, CHLee, COPark, CHKim, PHwang, JYHa, JDAhn, SJ Pyrimidine-2,4-diamine derivative and anticancer pharmaceutical composition comprising same as effective ingredient US Patent  US10053458 Publication Date 8/21/2018 
Target
Name:
ALK tyrosine kinase receptor [L1196M]
Synonyms:
ALK ALK tyrosine kinase receptor (ALK) (L1196M) ALK tyrosine kinase receptor (L1196M) Anaplastic lymphoma kinase L1196M (ALK L1196M) | Tyrosine-protein kinase receptor [L1196M]
Type:
Mol. Mass.:
176471.13
Organism:
Homo sapiens (Human)
Description:
Q9UM73[L1196M]
Residue:
1620
  
Inhibitor
Name:
BDBM243400
Synonyms:
1-(6-(5-chloro-4-(2-(isopropylsulfonyl)phenylamino)pyrimidin-2-yl)amino-7-methoxy-1,1-dimethyl-3,4-dihydroisoquinolin-2(1H)-yl)-2,2,2-trifluoroethane-1-one | US10053458, 32
Type:
Small organic molecule
Emp. Form.:
C27H29ClF3N5O4S
Mol. Mass.:
612.063
SMILES:
COc1cc2c(CCN(C(=O)C(F)(F)F)C2(C)C)cc1Nc1ncc(Cl)c(Nc2ccccc2S(=O)(=O)C(C)C)n1
: