Target
Orexin receptor type 2
Ligand
BDBM143761
Substrate
Meas. Tech.
Receptor Radioligand Binding Assay
Ki
>10000±n/a nM
Citation
 Gelin, CFLebold, TPShireman, BT Substituted 2-azabicycles and their use as orexin receptor modulators US Patent  US9845333 Publication Date 12/19/2017 
Target
Name:
Orexin receptor type 2
Synonyms:
Hcrtr2 OX2R_RAT Orexin receptor type 2 (OX2) Ox-2-R Ox2R
Type:
Protein
Mol. Mass.:
52508.46
Organism:
Rattus norvegicus (Rat)
Description:
P56719
Residue:
460
  
Inhibitor
Name:
BDBM143761
Synonyms:
US10183953, Example 25 US8969352, 23 US8969352, 25 US9845333, 25
Type:
Small organic molecule
Emp. Form.:
C21H19F3N6O2
Mol. Mass.:
444.4098
SMILES:
Cc1ccc(c(n1)C(=O)N1CC2CC(Oc3ccc(cn3)C(F)(F)F)C1C2)-n1nccn1
: