Target
Orexin receptor type 2
Ligand
BDBM143787
Substrate
Meas. Tech.
Receptor Radioligand Binding Assay
Ki
972±n/a nM
Citation
 Gelin, CFLebold, TPShireman, BT Substituted 2-azabicycles and their use as orexin receptor modulators US Patent  US9845333 Publication Date 12/19/2017 
Target
Name:
Orexin receptor type 2
Synonyms:
Hcrtr2 OX2R_RAT Orexin receptor type 2 (OX2) Ox-2-R Ox2R
Type:
Protein
Mol. Mass.:
52508.46
Organism:
Rattus norvegicus (Rat)
Description:
P56719
Residue:
460
  
Inhibitor
Name:
BDBM143787
Synonyms:
US10183953, Example 48 US9611277, Example 48 | US9845333, 48
Type:
Small organic molecule
Emp. Form.:
C22H18BrFN4O2
Mol. Mass.:
469.306
SMILES:
Fc1cccc(C(=O)N2CC3CC(Oc4ccc(Br)cn4)C2C3)c1-c1ncccn1
: