Target
Orexin/Hypocretin receptor type 1
Ligand
BDBM143796
Substrate
Meas. Tech.
Radioligand Binding Assay
Ki
6.00±n/a nM
Citation
 Gelin, CFLebold, TPShireman, BT Substituted 2-azabicycles and their use as orexin receptor modulators US Patent  US9845333 Publication Date 12/19/2017 
Target
Name:
Orexin/Hypocretin receptor type 1
Synonyms:
Hcrtr1 OX1R_RAT Orexin receptor type 1 (OX1R) Ox1-R | Ox1R
Type:
Protein
Mol. Mass.:
46817.55
Organism:
Rattus norvegicus (Rat)
Description:
P56718
Residue:
416
  
Inhibitor
Name:
BDBM143796
Synonyms:
US10183953, Example 57 US9611277, Example 57 | US9845333, 57
Type:
Small organic molecule
Emp. Form.:
C21H18F4N6O
Mol. Mass.:
446.4008
SMILES:
Fc1ccc(c(c1)C(=O)N1CC2CC(Nc3ccc(cn3)C(F)(F)F)C1C2)-n1nccn1
: