Target
Cathepsin B
Ligand
BDBM19812
Substrate
BDBM19485
Meas. Tech.
In Vitro Enzyme Inhibition Assay
pH
5.5±n/a
Temperature
295.15±n/a K
Ki
7300±n/a nM
Citation
 Marquis, RWRu, YZeng, JTrout, RELoCastro, SMGribble, ADWitherington, JFenwick, AEGarnier, BTomaszek, TTew, DHemling, MEQuinn, CJSmith, WWZhao, BMcQueney, MSJanson, CAD'Alessio, KVeber, DF Cyclic ketone inhibitors of the cysteine protease cathepsin K. J Med Chem 44:725-36 (2001)  
Target
Name:
Cathepsin B
Synonyms:
APP secretase CATB_HUMAN CTSB Cathepsin B light chain | Cathepsin B1
Type:
Enzyme
Mol. Mass.:
37819.69
Organism:
Homo sapiens (Human)
Description:
gi_63102437
Residue:
339
  
Inhibitor
Name:
BDBM19812
Synonyms:
[(2S)-1-{3-[(2S)-2-{[(benzyloxy)carbonyl]amino}-4-methylpentanamido]-4-oxopyrrolidin-1-yl}-4-methyl-1-oxopentan-2-yl](methyl)azanium chloride | pyrrolidinone analogue, 29
Type:
Small organic molecule
Emp. Form.:
C25H39N4O5
Mol. Mass.:
475.6004
SMILES:
C[NH2+][C@@H](CC(C)C)C(=O)N1CC(NC(=O)[C@H](CC(C)C)NC(=O)OCc2ccccc2)C(=O)C1
:
Substrate
Name:
BDBM19485
Synonyms:
Cbz-Phe-Arg-AMC Z-Phe-Arg-AMC.HCl
Type:
Emp. Form.:
Mol. Mass.:
SMILES:
: