Target
Procathepsin L
Ligand
BDBM19802
Substrate
BDBM19485
Meas. Tech.
In Vitro Enzyme Inhibition Assay
Ki
>1000±n/a nM
Citation
 Marquis, RWRu, YZeng, JTrout, RELoCastro, SMGribble, ADWitherington, JFenwick, AEGarnier, BTomaszek, TTew, DHemling, MEQuinn, CJSmith, WWZhao, BMcQueney, MSJanson, CAD'Alessio, KVeber, DF Cyclic ketone inhibitors of the cysteine protease cathepsin K. J Med Chem 44:725-36 (2001)  
Target
Name:
Procathepsin L
Synonyms:
CATL1_HUMAN CTSL CTSL1 Cathepsin L Cathepsin L1 heavy chain MEP cathepsin L preproprotein
Type:
Enzyme
Mol. Mass.:
37557.19
Organism:
Homo sapiens (Human)
Description:
Purchased from Calbiochem (San Diego, CA).
Residue:
333
  
Inhibitor
Name:
BDBM19802
Synonyms:
alcohol, 13 | benzyl N-[(1S)-1-[(4-hydroxyoxolan-3-yl)carbamoyl]-3-methylbutyl]carbamate
Type:
Small organic molecule
Emp. Form.:
C18H26N2O5
Mol. Mass.:
350.4094
SMILES:
CC(C)C[C@H](NC(=O)OCc1ccccc1)C(=O)NC1COCC1O
:
Substrate
Name:
BDBM19485
Synonyms:
Cbz-Phe-Arg-AMC Z-Phe-Arg-AMC.HCl
Type:
Emp. Form.:
Mol. Mass.:
SMILES:
: