Target
Cathepsin S
Ligand
BDBM19809
Substrate
BDBM19490
Meas. Tech.
In Vitro Enzyme Inhibition Assay
Ki
51±n/a nM
Citation
 Marquis, RWRu, YZeng, JTrout, RELoCastro, SMGribble, ADWitherington, JFenwick, AEGarnier, BTomaszek, TTew, DHemling, MEQuinn, CJSmith, WWZhao, BMcQueney, MSJanson, CAD'Alessio, KVeber, DF Cyclic ketone inhibitors of the cysteine protease cathepsin K. J Med Chem 44:725-36 (2001)  
Target
Name:
Cathepsin S
Synonyms:
CATS_HUMAN Cathepsin S (Cat S) | cathepsin S preproprotein
Type:
Protein
Mol. Mass.:
37507.38
Organism:
Homo sapiens (Human)
Description:
P25774
Residue:
331
  
Inhibitor
Name:
BDBM19809
Synonyms:
benzyl N-[(1S)-1-({1-[(2S)-2-{[(benzyloxy)carbonyl](methyl)amino}-4-methylpentanoyl]-4-oxopyrrolidin-3-yl}carbamoyl)-3-methylbutyl]-N-methylcarbamate | pyrrolidinone analogue, 26
Type:
Small organic molecule
Emp. Form.:
C34H46N4O7
Mol. Mass.:
622.7516
SMILES:
CC(C)C[C@H](N(C)C(=O)OCc1ccccc1)C(=O)NC1CN(CC1=O)C(=O)[C@H](CC(C)C)N(C)C(=O)OCc1ccccc1
:
Substrate
Name:
BDBM19490
Synonyms:
Cbz-Val-Val-Arg-AMC Z-Val-Val-Arg-AMC
Type:
Emp. Form.:
Mol. Mass.:
SMILES:
: