Target
Cathepsin S
Ligand
BDBM19812
Substrate
BDBM19490
Meas. Tech.
In Vitro Enzyme Inhibition Assay
Ki
290±n/a nM
Citation
 Marquis, RWRu, YZeng, JTrout, RELoCastro, SMGribble, ADWitherington, JFenwick, AEGarnier, BTomaszek, TTew, DHemling, MEQuinn, CJSmith, WWZhao, BMcQueney, MSJanson, CAD'Alessio, KVeber, DF Cyclic ketone inhibitors of the cysteine protease cathepsin K. J Med Chem 44:725-36 (2001)  
Target
Name:
Cathepsin S
Synonyms:
CATS_HUMAN Cathepsin S (Cat S) | cathepsin S preproprotein
Type:
Protein
Mol. Mass.:
37507.38
Organism:
Homo sapiens (Human)
Description:
P25774
Residue:
331
  
Inhibitor
Name:
BDBM19812
Synonyms:
[(2S)-1-{3-[(2S)-2-{[(benzyloxy)carbonyl]amino}-4-methylpentanamido]-4-oxopyrrolidin-1-yl}-4-methyl-1-oxopentan-2-yl](methyl)azanium chloride | pyrrolidinone analogue, 29
Type:
Small organic molecule
Emp. Form.:
C25H39N4O5
Mol. Mass.:
475.6004
SMILES:
C[NH2+][C@@H](CC(C)C)C(=O)N1CC(NC(=O)[C@H](CC(C)C)NC(=O)OCc2ccccc2)C(=O)C1
:
Substrate
Name:
BDBM19490
Synonyms:
Cbz-Val-Val-Arg-AMC Z-Val-Val-Arg-AMC
Type:
Emp. Form.:
Mol. Mass.:
SMILES:
: