Target
Ectonucleotide pyrophosphatase/phosphodiesterase family member 2
Ligand
BDBM362974
Substrate
Meas. Tech.
Inhibition Assay
IC50
<500±n/a nM
Citation
 Hutchinson, JHLonergan, DHuang, FRowbottom, MCalderon, I Autotaxin inhibitor compounds US Patent  US9850203 Publication Date 12/26/2017 
Target
Name:
Ectonucleotide pyrophosphatase/phosphodiesterase family member 2
Synonyms:
ATX Autotaxin (ATX) ENPP2 Ectonucleotide Pyrophosphatase/Phosphodiesterase 2 (ENPP2) Extracellular lysophospholipase D PDNP2
Type:
Enzyme
Mol. Mass.:
99007.13
Organism:
Homo sapiens (Human)
Description:
Q13822
Residue:
863
  
Inhibitor
Name:
BDBM362974
Synonyms:
3-((6-Chloro-1-(2-(3-(1,1-dioxidothiomorpholino)azetidin-1-yl)-2-oxoethyl)-7-fluoro-2-methyl-1H-indol-3-yl)thio)benzoic acid | US9850203, Compound 1-48
Type:
Small organic molecule
Emp. Form.:
C25H25ClFN3O5S2
Mol. Mass.:
566.065
SMILES:
Cc1c(Sc2cccc(c2)C(O)=O)c2ccc(Cl)c(F)c2n1CC(=O)N1CC(C1)N1CCS(=O)(=O)CC1
: