Target
Ectonucleotide pyrophosphatase/phosphodiesterase family member 2
Ligand
BDBM363004
Substrate
Meas. Tech.
Inhibition Assay
IC50
<500±n/a nM
Citation
 Hutchinson, JHLonergan, DHuang, FRowbottom, MCalderon, I Autotaxin inhibitor compounds US Patent  US9850203 Publication Date 12/26/2017 
Target
Name:
Ectonucleotide pyrophosphatase/phosphodiesterase family member 2
Synonyms:
ATX Autotaxin (ATX) ENPP2 Ectonucleotide Pyrophosphatase/Phosphodiesterase 2 (ENPP2) Extracellular lysophospholipase D PDNP2
Type:
Enzyme
Mol. Mass.:
99007.13
Organism:
Homo sapiens (Human)
Description:
Q13822
Residue:
863
  
Inhibitor
Name:
BDBM363004
Synonyms:
3-((6-Chloro-1-(2-(3-cyclopropyl-3-hydroxyazetidin-1-yl)-2-oxoethyl)-7-fluoro-2-methyl-1H-indol-3-yl)thio)benzoic acid | US9850203, Compound 1-82
Type:
Small organic molecule
Emp. Form.:
C24H22ClFN2O4S
Mol. Mass.:
488.959
SMILES:
Cc1c(Sc2cccc(c2)C(O)=O)c2ccc(Cl)c(F)c2n1CC(=O)N1CC(O)(C1)C1CC1
: