Target
Ectonucleotide pyrophosphatase/phosphodiesterase family member 2
Ligand
BDBM363018
Substrate
Meas. Tech.
Inhibition Assay
IC50
<500±n/a nM
Citation
 Hutchinson, JHLonergan, DHuang, FRowbottom, MCalderon, I Autotaxin inhibitor compounds US Patent  US9850203 Publication Date 12/26/2017 
Target
Name:
Ectonucleotide pyrophosphatase/phosphodiesterase family member 2
Synonyms:
ATX Autotaxin (ATX) ENPP2 Ectonucleotide Pyrophosphatase/Phosphodiesterase 2 (ENPP2) Extracellular lysophospholipase D PDNP2
Type:
Enzyme
Mol. Mass.:
99007.13
Organism:
Homo sapiens (Human)
Description:
Q13822
Residue:
863
  
Inhibitor
Name:
BDBM363018
Synonyms:
3-((6-Chloro-7-fluoro-2-methyl-1-(2-oxo-2-(5-azaspiro[2.4]heptan-5-yl)ethyl)-1H-indol-3-yl)thio)benzoic acid | US9850203, Compound 1-95
Type:
Small organic molecule
Emp. Form.:
C24H22ClFN2O3S
Mol. Mass.:
472.959
SMILES:
Cc1c(Sc2cccc(c2)C(O)=O)c2ccc(Cl)c(F)c2n1CC(=O)N1CCC2(CC2)C1
: