Target
Cathepsin K
Ligand
BDBM19857
Substrate
BDBM19480
Meas. Tech.
Enzyme Inhibition Assay and Bone Resorption Assay
pH
5.5±n/a
Temperature
295.15±n/a K
IC50
9.5±0.6 nM
EC50
41±12 nM
Citation
 Falgueyret, JPDesmarais, SOballa, RBlack, WCCromlish, WKhougaz, KLamontagne, SMassé, FRiendeau, DToulmond, SPercival, MD Lysosomotropism of basic cathepsin K inhibitors contributes to increased cellular potencies against off-target cathepsins and reduced functional selectivity. J Med Chem 48:7535-43 (2005)  
Target
Name:
Cathepsin K
Synonyms:
CATK_RABIT | CTSK
Type:
Enzyme
Mol. Mass.:
36879.51
Organism:
Oryctolagus cuniculus (rabbit)
Description:
Residue:
329
  
Inhibitor
Name:
BDBM19857
Synonyms:
N-{1-[(cyanomethyl)carbamoyl]cyclohexyl}-4-[2-(morpholin-4-yl)-1,3-thiazol-4-yl]benzamide | aryl-morpholino-containing analogue, 12
Type:
Small organic molecule
Emp. Form.:
C23H27N5O3S
Mol. Mass.:
453.557
SMILES:
O=C(NC1(CCCCC1)C(=O)NCC#N)c1ccc(cc1)-c1csc(n1)N1CCOCC1
:
Substrate
Name:
BDBM19480
Synonyms:
Cbz-Leu-Arg-AMC Z-Leu-Arg-AMC
Type:
Emp. Form.:
Mol. Mass.:
SMILES:
: