Target
Cathepsin S
Ligand
BDBM19856
Substrate
BDBM19490
Meas. Tech.
Enzyme Inhibition Assay
IC50
34100±n/a nM
EC50
740±n/a nM
Citation
 Falgueyret, JPDesmarais, SOballa, RBlack, WCCromlish, WKhougaz, KLamontagne, SMassé, FRiendeau, DToulmond, SPercival, MD Lysosomotropism of basic cathepsin K inhibitors contributes to increased cellular potencies against off-target cathepsins and reduced functional selectivity. J Med Chem 48:7535-43 (2005)  
Target
Name:
Cathepsin S
Synonyms:
CATS_MOUSE Ctss
Type:
Enzyme
Mol. Mass.:
38476.67
Organism:
Mus musculus (Mouse)
Description:
O70370
Residue:
340
  
Inhibitor
Name:
BDBM19856
Synonyms:
(2R)-N-(cyanomethyl)-4-methyl-2-{3-[4-(piperazin-1-yl)phenyl]phenyl}pentanamide JMC463709 (R)-2 | piperazine-containing compound, 11
Type:
Small organic molecule
Emp. Form.:
C24H30N4O
Mol. Mass.:
390.5212
SMILES:
CC(C)C[C@@H](C(=O)NCC#N)c1cccc(c1)-c1ccc(cc1)N1CCNCC1
:
Substrate
Name:
BDBM19490
Synonyms:
Cbz-Val-Val-Arg-AMC Z-Val-Val-Arg-AMC
Type:
Emp. Form.:
Mol. Mass.:
SMILES:
: