Target
Programmed cell death 1 ligand 1
Ligand
BDBM363193
Substrate
Meas. Tech.
Homogenous Time-Resolved Fluorescence (HTRF) Binding Assay
IC50
5.3±n/a nM
Citation
 Chupak, LSDing, MMartin, SWZheng, XHewawasam, PConnolly, TPXu, NYeung, KZhu, JLangley, DRScola, PM Compounds useful as immunomodulators US Patent  US9850225 Publication Date 12/26/2017 
Target
Name:
Programmed cell death 1 ligand 1
Synonyms:
B7 homolog 1 B7H1 CD274 PD-L1 PDCD1 ligand 1 PDCD1LG1 Programmed cell death 1 ligand 1 | Programmed death ligand 1
Type:
PROTEIN
Mol. Mass.:
33278.49
Organism:
Homo sapiens (Human)
Description:
ChEMBL_109807
Residue:
290
  
Inhibitor
Name:
BDBM363193
Synonyms:
(R)-2-(2-(3-cyanobenzyloxy)-4-(3-(2,3-dihydrobenzo[b][1,4]dioxin-6-yl)-2-methylbenzyloxy)benzylamino)-3-hydroxypropanoic acid | US9850225, Example 1122
Type:
Small organic molecule
Emp. Form.:
C34H32N2O7
Mol. Mass.:
580.6271
SMILES:
Cc1c(COc2ccc(CN[C@H](CO)C(O)=O)c(OCc3cccc(c3)C#N)c2)cccc1-c1ccc2OCCOc2c1
: