Target
Programmed cell death 1 ligand 1
Ligand
BDBM363286
Substrate
Meas. Tech.
Homogenous Time-Resolved Fluorescence (HTRF) Binding Assay
IC50
2.71±n/a nM
Citation
 Chupak, LSDing, MMartin, SWZheng, XHewawasam, PConnolly, TPXu, NYeung, KZhu, JLangley, DRScola, PM Compounds useful as immunomodulators US Patent  US9850225 Publication Date 12/26/2017 
Target
Name:
Programmed cell death 1 ligand 1
Synonyms:
B7 homolog 1 B7H1 CD274 PD-L1 PDCD1 ligand 1 PDCD1LG1 Programmed cell death 1 ligand 1 | Programmed death ligand 1
Type:
PROTEIN
Mol. Mass.:
33278.49
Organism:
Homo sapiens (Human)
Description:
ChEMBL_109807
Residue:
290
  
Inhibitor
Name:
BDBM363286
Synonyms:
(R)-2-((5-chloro-2-((3-cyanobenzyl)oxy)-4-((3-(2,3-dihydrobenzo[b][1,4]dioxin-6-yl)-2-methylbenzyl)oxy)benzyl)amino)-4-hydroxybutanoic acid | US9850225, Example 1205
Type:
Small organic molecule
Emp. Form.:
C35H33ClN2O7
Mol. Mass.:
629.099
SMILES:
Cc1c(COc2cc(OCc3cccc(c3)C#N)c(CN[C@H](CCO)C(O)=O)cc2Cl)cccc1-c1ccc2OCCOc2c1
: