Target
Bromodomain-containing protein 4 [342-460]
Ligand
BDBM363500
Substrate
Meas. Tech.
AlphaScreen Assay
IC50
<200±n/a nM
Citation
 Combs, APYue, EWMaduskuie, TP Tricyclic heterocycles as BET protein inhibitors US Patent  US9850257 Publication Date 12/26/2017 
Target
Name:
Bromodomain-containing protein 4 [342-460]
Synonyms:
BRD4 BRD4_HUMAN Bromodomain-containing protein 4 (BRD4)(BD2) | HUNK1
Type:
Enzyme Catalytic Domain
Mol. Mass.:
13783.81
Organism:
Homo sapiens (Human)
Description:
a.a. 342-460 (BRD4-BD2)
Residue:
119
  
Inhibitor
Name:
BDBM363500
Synonyms:
9-(3,5-Dimethylisoxazol-4-yl)-6-methoxy-3-pyridin-2-yl-2,3-dihydro[1,4]oxazino[2,3,4-hi]indazole | US9850257, Example 7
Type:
Small organic molecule
Emp. Form.:
C20H18N4O3
Mol. Mass.:
362.3819
SMILES:
COc1nn2C(COc3c(ccc1c23)-c1c(C)noc1C)c1ccccn1
: