Target
Bromodomain-containing protein 4 [49-170]
Ligand
BDBM363502
Substrate
Meas. Tech.
AlphaScreen Assay
IC50
600±n/a nM
Citation
 Combs, APYue, EWMaduskuie, TP Tricyclic heterocycles as BET protein inhibitors US Patent  US9850257 Publication Date 12/26/2017 
Target
Name:
Bromodomain-containing protein 4 [49-170]
Synonyms:
BRD4 BRD4-BD1 (aa 49-170) Bromodomain containing 4 (aa 49-170) Bromodomain-containing protein 4 (BRD4)(49-170) HUNK1
Type:
Enzyme Catalytic Domain
Mol. Mass.:
14593.14
Organism:
Homo sapiens (Human)
Description:
aa 49-170 (BRD4-BD1)
Residue:
122
  
Inhibitor
Name:
BDBM363502
Synonyms:
US9850257, Example 9
Type:
Small organic molecule
Emp. Form.:
C20H16BrN3O2
Mol. Mass.:
410.264
SMILES:
Cc1noc(C)c1-c1cc(Br)c2cnn3C(COc1c23)c1ccccc1
: