Target
P2X purinoceptor 3
Ligand
BDBM246806
Substrate
Meas. Tech.
Receptor Inhibition Assay
pH
7.5±n/a
IC50
5.00±n/a nM
Comments
extracted
Citation
 Kai, HTanaka, SHiramatsu, YNozu, ANakamura, K Heterocyclic ring and carbocyclic derivative US Patent  US9550763 Publication Date 1/24/2017 
Target
Name:
P2X purinoceptor 3
Synonyms:
ATP receptor P2RX3 P2X purinoceptor 3 P2X purinoceptor 3 (P2X3) P2X3 purinoceptor p2x3 + hsa
Type:
Protein
Mol. Mass.:
44292.02
Organism:
Homo sapiens (Human)
Description:
P56373
Residue:
397
  
Inhibitor
Name:
BDBM246806
Synonyms:
US9550763, Compound I-478
Type:
Small organic molecule
Emp. Form.:
C28H25ClN4O5
Mol. Mass.:
532.975
SMILES:
OC(=O)c1cccc(Oc2ccc(cc2)\N=c2/[nH]cc(C3CCOCC3)c(=O)n2Cc2ccc(Cl)cc2)n1
: