Target
Tyrosine-protein kinase BTK
Ligand
BDBM230107
Substrate
Meas. Tech.
Enzyme Assay
IC50
0.550±n/a nM
Citation
 Watterson, SH Substituted tetrahydrocarbazole and carbazole carboxamide compounds US Patent  US9850258 Publication Date 12/26/2017 
Target
Name:
Tyrosine-protein kinase BTK
Synonyms:
AGMX1 Agammaglobulinaemia tyrosine kinase B cell progenitor kinase BPK BTK_HUMAN Tyrosine Kinase BTK Tyrosine-protein kinase BTK (BTK)
Type:
Enzyme
Mol. Mass.:
76289.95
Organism:
Homo sapiens (Human)
Description:
Q06187
Residue:
659
  
Inhibitor
Name:
BDBM230107
Synonyms:
US10106559, Example 33 US9334290, 32 | US9850258, Example 33
Type:
Small organic molecule
Emp. Form.:
C31H24Cl2N4O4
Mol. Mass.:
587.453
SMILES:
Cc1c(cccc1-n1c(=O)cc2c(Cl)cccn2c1=O)-c1c(Cl)cc(C(N)=O)c2[nH]c3cc(ccc3c12)C(C)(C)O
: