Target
Tyrosine-protein kinase JAK2
Ligand
BDBM230122
Substrate
Meas. Tech.
Tyrosine Kinase Assay
IC50
>2000±n/a nM
Citation
 Watterson, SH Substituted tetrahydrocarbazole and carbazole carboxamide compounds US Patent  US9850258 Publication Date 12/26/2017 
Target
Name:
Tyrosine-protein kinase JAK2
Synonyms:
JAK-2 JAK2_HUMAN Janus kinase 2 (JAK2) | Janus kinase 2 (a protein tyrosine kinase)
Type:
Protein
Mol. Mass.:
130684.68
Organism:
Homo sapiens (Human)
Description:
O60674
Residue:
1132
  
Inhibitor
Name:
BDBM230122
Synonyms:
US10106559, Example 51 US9334290, 51 | US9850258, Example 51
Type:
Small organic molecule
Emp. Form.:
C31H24F2N4O4
Mol. Mass.:
554.5435
SMILES:
Cc1c(cccc1-n1c(=O)[nH]c2cc(F)ccc2c1=O)-c1c(F)cc(C(N)=O)c2[nH]c3cc(ccc3c12)C(C)(C)O
: