Target
Tyrosine-protein kinase JAK2
Ligand
BDBM230130
Substrate
Meas. Tech.
Tyrosine Kinase Assay
IC50
1900±n/a nM
Citation
 Watterson, SH Substituted tetrahydrocarbazole and carbazole carboxamide compounds US Patent  US9850258 Publication Date 12/26/2017 
Target
Name:
Tyrosine-protein kinase JAK2
Synonyms:
JAK-2 JAK2_HUMAN Janus kinase 2 (JAK2) | Janus kinase 2 (a protein tyrosine kinase)
Type:
Protein
Mol. Mass.:
130684.68
Organism:
Homo sapiens (Human)
Description:
O60674
Residue:
1132
  
Inhibitor
Name:
BDBM230130
Synonyms:
US10106559, Example 61 US9334290, 60 US9334290, 62 | US9850258, Example 61
Type:
Small organic molecule
Emp. Form.:
C31H23ClF2N4O4
Mol. Mass.:
588.989
SMILES:
Cn1c2c(F)cccc2c(=O)n(-c2cccc(c2Cl)-c2c(F)cc(C(N)=O)c3[nH]c4cc(ccc4c23)C(C)(C)O)c1=O
: