Target
Isocitrate dehydrogenase [NADP] cytoplasmic [R132C]
Ligand
BDBM363602
Substrate
Meas. Tech.
In Vitro Assay
IC50
<500±n/a nM
Citation
 Popovici-Muller, JLemieux, RMTravins, JCai, ZCui, DZhou, D Therapeutically active compositions and their methods of use US Patent  US9850277 Publication Date 12/26/2017 
Target
Name:
Isocitrate dehydrogenase [NADP] cytoplasmic [R132C]
Synonyms:
IDH1 IDH1(R132C) Isocitrate dehydrogenase (IDH1)(R132C) Isocitrate dehydrogenase [NADP] cytoplasmic (IDH1) (R132C) | PICD
Type:
Enzyme Catalytic Domain
Mol. Mass.:
46607.23
Organism:
Homo sapiens (Human)
Description:
O75874[R132C]
Residue:
414
  
Inhibitor
Name:
BDBM363602
Synonyms:
US10640534, Compound 93 US10717764, Compound 93 US11667673, Compound 93 | US9850277, Compound 93
Type:
Small organic molecule
Emp. Form.:
C35H34ClF4N7O5
Mol. Mass.:
744.135
SMILES:
CC(C)(C)OC(=O)N1C[C@H](N(C(=O)C1)c1nccc(n1)C#N)C(=O)N([C@H](C(=O)NC1CCC(F)(F)CC1)c1ccccc1Cl)c1cc(F)cc(F)c1
: