Target
cAMP and cAMP-inhibited cGMP 3',5'-cyclic phosphodiesterase 10A
Ligand
BDBM363763
Substrate
Meas. Tech.
Enzymatic Assay
IC50
350±n/a nM
Citation
 Geneste, HOchse, MDrescher, KDinges, JJakob, C Inhibitor compounds of phosphodiesterase type 10A US Patent  US9856220 Publication Date 1/2/2018 
Target
Name:
cAMP and cAMP-inhibited cGMP 3',5'-cyclic phosphodiesterase 10A
Synonyms:
3',5'-cyclic phosphodiesterase PDE10_HUMAN Phosphodiesterase 10A
Type:
Protein
Mol. Mass.:
88412.52
Organism:
Homo sapiens (Human)
Description:
Q9Y233
Residue:
779
  
Inhibitor
Name:
BDBM363763
Synonyms:
2-Ethyl-6,7-dimethoxy-1-oxo-1,2-dihydro-isoquinoline-4-carboxylic acid (1,3-dimethyl-butyl)-amide | US9856220, Example 23
Type:
Small organic molecule
Emp. Form.:
C20H28N2O4
Mol. Mass.:
360.4473
SMILES:
CCn1cc(C(=O)NC(C)CC(C)C)c2cc(OC)c(OC)cc2c1=O
: