Target
cAMP and cAMP-inhibited cGMP 3',5'-cyclic phosphodiesterase 10A
Ligand
BDBM363781
Substrate
Meas. Tech.
Enzymatic Assay
IC50
<100±n/a nM
Citation
 Geneste, HOchse, MDrescher, KDinges, JJakob, C Inhibitor compounds of phosphodiesterase type 10A US Patent  US9856220 Publication Date 1/2/2018 
Target
Name:
cAMP and cAMP-inhibited cGMP 3',5'-cyclic phosphodiesterase 10A
Synonyms:
3',5'-cyclic phosphodiesterase PDE10_HUMAN Phosphodiesterase 10A
Type:
Protein
Mol. Mass.:
88412.52
Organism:
Homo sapiens (Human)
Description:
Q9Y233
Residue:
779
  
Inhibitor
Name:
BDBM363781
Synonyms:
2-(1-Ethyl-propyl)-6,7-dimethoxy-1-oxo-1,2-dihydro-isoquinoline-4-carboxylic acid indan-1-ylamide | US9856220, Example 135
Type:
Small organic molecule
Emp. Form.:
C26H30N2O4
Mol. Mass.:
434.5274
SMILES:
CCC(CC)n1cc(C(=O)NC2CCc3ccccc23)c2cc(OC)c(OC)cc2c1=O
: