Target
cAMP and cAMP-inhibited cGMP 3',5'-cyclic phosphodiesterase 10A
Ligand
BDBM363802
Substrate
Meas. Tech.
Enzymatic Assay
IC50
350±n/a nM
Citation
 Geneste, HOchse, MDrescher, KDinges, JJakob, C Inhibitor compounds of phosphodiesterase type 10A US Patent  US9856220 Publication Date 1/2/2018 
Target
Name:
cAMP and cAMP-inhibited cGMP 3',5'-cyclic phosphodiesterase 10A
Synonyms:
3',5'-cyclic phosphodiesterase PDE10A Phosphodiesterase 10 (PDE10) | Phosphodiesterase 10A
Type:
Protein
Mol. Mass.:
88412.52
Organism:
Homo sapiens (Human)
Description:
Q9Y233
Residue:
1055
  
Inhibitor
Name:
BDBM363802
Synonyms:
2-Ethyl-6,7-dimethoxy-N-(6-methyl-2,3-dihydro-1H-inden-1-yl)-1-oxo-1,2-dihydroisoquinoline-4-carboxamide | US9856220, Example 167
Type:
Small organic molecule
Emp. Form.:
C24H26N2O4
Mol. Mass.:
406.4742
SMILES:
CCn1cc(C(=O)NC2CCc3ccc(C)cc23)c2cc(OC)c(OC)cc2c1=O
: