Target
cAMP and cAMP-inhibited cGMP 3',5'-cyclic phosphodiesterase 10A
Ligand
BDBM363844
Substrate
Meas. Tech.
Enzymatic Assay
IC50
150±n/a nM
Citation
 Geneste, HOchse, MDrescher, KDinges, JJakob, C Inhibitor compounds of phosphodiesterase type 10A US Patent  US9856220 Publication Date 1/2/2018 
Target
Name:
cAMP and cAMP-inhibited cGMP 3',5'-cyclic phosphodiesterase 10A
Synonyms:
3',5'-cyclic phosphodiesterase PDE10A Phosphodiesterase 10 (PDE10) | Phosphodiesterase 10A
Type:
Protein
Mol. Mass.:
88412.52
Organism:
Homo sapiens (Human)
Description:
Q9Y233
Residue:
1055
  
Inhibitor
Name:
BDBM363844
Synonyms:
(S)-N-(1-(4-fluorophenyl)ethyl)-6,7-dimethoxy-1-oxo-2-(pentan-3-yl)-1,2-dihydroisoquinoline-4-carboxamide | US9856220, Example 246
Type:
Small organic molecule
Emp. Form.:
C25H29FN2O4
Mol. Mass.:
440.5072
SMILES:
CCC(CC)n1cc(C(=O)N[C@@H](C)c2ccc(F)cc2)c2cc(OC)c(OC)cc2c1=O
: