Target
cAMP and cAMP-inhibited cGMP 3',5'-cyclic phosphodiesterase 10A
Ligand
BDBM363870
Substrate
Meas. Tech.
Enzymatic Assay
IC50
350±n/a nM
Citation
 Geneste, HOchse, MDrescher, KDinges, JJakob, C Inhibitor compounds of phosphodiesterase type 10A US Patent  US9856220 Publication Date 1/2/2018 
Target
Name:
cAMP and cAMP-inhibited cGMP 3',5'-cyclic phosphodiesterase 10A
Synonyms:
3',5'-cyclic phosphodiesterase PDE10_HUMAN Phosphodiesterase 10A
Type:
Protein
Mol. Mass.:
88412.52
Organism:
Homo sapiens (Human)
Description:
Q9Y233
Residue:
779
  
Inhibitor
Name:
BDBM363870
Synonyms:
N-[[2-(1,1-Dimethylpropoxy)-4-methyl-phenyl]methyl]-2-ethyl-6,7-dimethoxy-1-oxo-isoquinoline-4-carboxamide | US9856220, Example 277
Type:
Small organic molecule
Emp. Form.:
C27H34N2O5
Mol. Mass.:
466.5693
SMILES:
CCn1cc(C(=O)NCc2ccc(C)cc2OC(C)(C)CC)c2cc(OC)c(OC)cc2c1=O
: