Target
cAMP and cAMP-inhibited cGMP 3',5'-cyclic phosphodiesterase 10A
Ligand
BDBM363876
Substrate
Meas. Tech.
Enzymatic Assay
IC50
350±n/a nM
Citation
 Geneste, HOchse, MDrescher, KDinges, JJakob, C Inhibitor compounds of phosphodiesterase type 10A US Patent  US9856220 Publication Date 1/2/2018 
Target
Name:
cAMP and cAMP-inhibited cGMP 3',5'-cyclic phosphodiesterase 10A
Synonyms:
3',5'-cyclic phosphodiesterase PDE10_HUMAN Phosphodiesterase 10A
Type:
Protein
Mol. Mass.:
88412.52
Organism:
Homo sapiens (Human)
Description:
Q9Y233
Residue:
779
  
Inhibitor
Name:
BDBM363876
Synonyms:
2-Ethyl-N-(2-isopropoxy-4-methylbenzyl)-6,7-dimethoxy-1-oxo-1,2-dihydroisoquinoline-4-carboxamide | US9856220, Example 302
Type:
Small organic molecule
Emp. Form.:
C25H30N2O5
Mol. Mass.:
438.5161
SMILES:
CCn1cc(C(=O)NCc2ccc(C)cc2OC(C)C)c2cc(OC)c(OC)cc2c1=O
: