Target
Cathepsin K
Ligand
BDBM19907
Substrate
BDBM19480
Meas. Tech.
In Vitro Enzyme Inhibition Assay and Bone-Resorption Assay
pH
5.5±n/a
Temperature
295.15±n/a K
IC50
9±n/a nM
EC50
33±n/a nM
Citation
 Robichaud, JBayly, CIBlack, WCDesmarais, SLéger, SMassé, FMcKay, DJOballa, RMPâquet, JPercival, MDTruchon, JFWesolowski, GCrane, SN Beta-substituted cyclohexanecarboxamide cathepsin K inhibitors: modification of the 1,2-disubstituted aromatic core. Bioorg Med Chem Lett 17:3146-51 (2007)  
Target
Name:
Cathepsin K
Synonyms:
CATK_RABIT | CTSK
Type:
Enzyme
Mol. Mass.:
36879.51
Organism:
Oryctolagus cuniculus (rabbit)
Description:
Residue:
329
  
Inhibitor
Name:
BDBM19907
Synonyms:
(1R,2R)-2-{1-benzyl-5-[4-(methylsulfanyl)phenyl]-1H-1,2,3-triazol-4-yl}-N-(cyanomethyl)-5,5-difluorocyclohexane-1-carboxamide | beta-substituted cyclohexanecarboxamide, 8
Type:
Small organic molecule
Emp. Form.:
C25H25F2N5OS
Mol. Mass.:
481.561
SMILES:
CSc1ccc(cc1)-c1c(nnn1Cc1ccccc1)[C@@H]1CCC(F)(F)C[C@H]1C(=O)NCC#N
:
Substrate
Name:
BDBM19480
Synonyms:
Cbz-Leu-Arg-AMC Z-Leu-Arg-AMC
Type:
Emp. Form.:
Mol. Mass.:
SMILES:
: