Target
Solute carrier family 22 member 12
Ligand
BDBM290431
Substrate
Meas. Tech.
Bioactivity Assay
IC50
<100±n/a nM
Citation
 Jiang, Y Carboxylic acid compound, method for preparation thereof, and use thereof US Patent  US9856239 Publication Date 1/2/2018 
Target
Name:
Solute carrier family 22 member 12
Synonyms:
OATL4 RST S22AC_HUMAN Solute carrier family 22 member 12 URAT1 Urate anion exchanger 1 (URAT1) | Uric Acid Transporter 1 (URAT1)
Type:
Enzyme
Mol. Mass.:
59638.65
Organism:
Homo sapiens (Human)
Description:
Q96S37
Residue:
553
  
Inhibitor
Name:
BDBM290431
Synonyms:
CAS No.:1352792-74-5 US10100016, Verinurad (RDEA3170) US10919858, Example 2C | US9856239, 41
Type:
Small organic molecule
Emp. Form.:
C20H16N2O2S
Mol. Mass.:
348.418
SMILES:
CC(C)(Sc1ccncc1-c1ccc(C#N)c2ccccc12)C(O)=O
: