Target
Voltage-dependent T-type calcium channel subunit alpha-1H
Ligand
BDBM363985
Substrate
Meas. Tech.
Activity Assay
IC50
98.0±n/a nM
Citation
 Masaki, HIwasaki, YKageyama, MUchino, Y Substituted tropane derivatives US Patent  US9856250 Publication Date 1/2/2018 
Target
Name:
Voltage-dependent T-type calcium channel subunit alpha-1H
Synonyms:
CAC1H_HUMAN Low-voltage-activated calcium channel alpha1 3.2 subunit Voltage-gated calcium channel voltage-dependent T-type calcium channel subunit alpha-1H isoform a
Type:
Enzyme Catalytic Domain
Mol. Mass.:
259187.68
Organism:
Homo sapiens (Human)
Description:
Calcium channel (Type T,L) 0 0::O95180
Residue:
2353
  
Inhibitor
Name:
BDBM363985
Synonyms:
US9856250, 32
Type:
Small organic molecule
Emp. Form.:
C25H39N3O4
Mol. Mass.:
445.5949
SMILES:
COc1cccc(OC(C)(C)C(=O)NC[C@H]2C[C@@H]3CC[C@H](C2)N3CC(=O)NC(C)(C)C)c1
: