Target
Voltage-dependent T-type calcium channel subunit alpha-1H
Ligand
BDBM364106
Substrate
Meas. Tech.
Activity Assay
IC50
83.0±n/a nM
Citation
 Masaki, HIwasaki, YKageyama, MUchino, Y Substituted tropane derivatives US Patent  US9856250 Publication Date 1/2/2018 
Target
Name:
Voltage-dependent T-type calcium channel subunit alpha-1H
Synonyms:
CAC1H_HUMAN Low-voltage-activated calcium channel alpha1 3.2 subunit Voltage-gated calcium channel voltage-dependent T-type calcium channel subunit alpha-1H isoform a
Type:
Enzyme Catalytic Domain
Mol. Mass.:
259187.68
Organism:
Homo sapiens (Human)
Description:
Calcium channel (Type T,L) 0 0::O95180
Residue:
2353
  
Inhibitor
Name:
BDBM364106
Synonyms:
US9856250, 147
Type:
Small organic molecule
Emp. Form.:
C22H32N4O
Mol. Mass.:
368.5157
SMILES:
Cc1cccc2[nH]c(C[C@@H]3C[C@@H]4CC[C@H](C3)N4CC(=O)NC(C)(C)C)nc12
: