Target
Voltage-dependent T-type calcium channel subunit alpha-1H
Ligand
BDBM364108
Substrate
Meas. Tech.
Activity Assay
IC50
49.0±n/a nM
Citation
 Masaki, HIwasaki, YKageyama, MUchino, Y Substituted tropane derivatives US Patent  US9856250 Publication Date 1/2/2018 
Target
Name:
Voltage-dependent T-type calcium channel subunit alpha-1H
Synonyms:
CAC1H_HUMAN Low-voltage-activated calcium channel alpha1 3.2 subunit Voltage-gated calcium channel voltage-dependent T-type calcium channel subunit alpha-1H isoform a
Type:
Enzyme Catalytic Domain
Mol. Mass.:
259187.68
Organism:
Homo sapiens (Human)
Description:
Calcium channel (Type T,L) 0 0::O95180
Residue:
2353
  
Inhibitor
Name:
BDBM364108
Synonyms:
US9856250, 160
Type:
Small organic molecule
Emp. Form.:
C22H35N5O2
Mol. Mass.:
401.5456
SMILES:
Cn1nc(cc1C(=O)NC[C@@H]1C[C@@H]2CC[C@H](C1)N2CC(=O)NC(C)(C)C)C1CC1
: