Target
Protein arginine N-methyltransferase 5
Ligand
BDBM364122
Substrate
Meas. Tech.
Biochemical Assay
IC50
1008±n/a nM
Citation
 Stupple, PAWalker, SRPinson, JLagiakos, HRLunniss, GEHolmes, IPStupple, AEBergman, YEFoitzik, RCKersten, WJCamerino, MA 2-(hetero)aryl-benzimidazole and imidazopyridine derivatives as inhibitors of asparagime emethyl transferase US Patent  US9856252 Publication Date 1/2/2018 
Target
Name:
Protein arginine N-methyltransferase 5
Synonyms:
72 kDa ICln-binding protein HRMT1L5 IBP72 Jak-binding protein 1 PRMT5/MEP50 complex Protein arginine methyltransferase 5 (PRMT5) SKB1 homolog Shk1 kinase-binding protein 1 homolog
Type:
Enzyme
Mol. Mass.:
72679.99
Organism:
Homo sapiens (Human)
Description:
O14744
Residue:
637
  
Inhibitor
Name:
BDBM364122
Synonyms:
US9856252, 14
Type:
Small organic molecule
Emp. Form.:
C25H23F3N4O
Mol. Mass.:
452.4715
SMILES:
FC(F)(F)c1ccc(COc2ccc(cc2)-c2nc3cc(cnc3[nH]2)C2CCNCC2)cc1
: