Target
Protein arginine N-methyltransferase 5
Ligand
BDBM364146
Substrate
Meas. Tech.
Biochemical Assay
IC50
2391±n/a nM
Citation
 Stupple, PAWalker, SRPinson, JLagiakos, HRLunniss, GEHolmes, IPStupple, AEBergman, YEFoitzik, RCKersten, WJCamerino, MA 2-(hetero)aryl-benzimidazole and imidazopyridine derivatives as inhibitors of asparagime emethyl transferase US Patent  US9856252 Publication Date 1/2/2018 
Target
Name:
Protein arginine N-methyltransferase 5
Synonyms:
72 kDa ICln-binding protein HRMT1L5 IBP72 Jak-binding protein 1 PRMT5/MEP50 complex Protein arginine methyltransferase 5 (PRMT5) SKB1 homolog Shk1 kinase-binding protein 1 homolog
Type:
Enzyme
Mol. Mass.:
72679.99
Organism:
Homo sapiens (Human)
Description:
O14744
Residue:
637
  
Inhibitor
Name:
BDBM364146
Synonyms:
US9856252, 38
Type:
Small organic molecule
Emp. Form.:
C23H19N5O
Mol. Mass.:
381.4299
SMILES:
Cn1ccc(n1)-c1ccc2nc([nH]c2n1)-c1ccc(COc2ccccc2)cc1
: