Target
Large envelope protein
Ligand
BDBM246810
Substrate
Meas. Tech.
HBsAg assay
Temperature
298.15±n/a K
IC50
10.00±n/a nM
Comments
extracted
Citation
 Han, XJiang, MWang, YYang, S Tetracyclic 4-oxo-pyridine-3-carboxylic acid derivatives for the treatment and prophylaxis of hepatitis B virus infection US Patent  US10053461 Publication Date 8/21/2018 
Target
Name:
Large envelope protein
Synonyms:
HBSAG_HBVD3 | S
Type:
Mol. Mass.:
42772.52
Organism:
Hepatitis B virus
Description:
P03138
Residue:
389
  
Inhibitor
Name:
BDBM246810
Synonyms:
US10053461, 1 trans-10-methoxy-11-(3-methoxypropoxy)-3,3-dimethyl-7-oxo-1,2,3,3a,7,12b-hexahydrocyclopenta[c]pyrido[2,1-a]isoquinoline-6-carboxylic acid
Type:
Small organic molecule
Emp. Form.:
C24H29NO6
Mol. Mass.:
427.4902
SMILES:
COCCCOc1cc2[C@@H]3CCC(C)(C)[C@H]3n3cc(C(O)=O)c(=O)cc3-c2cc1OC
: