Target
Estrogen receptor
Ligand
BDBM19965
Substrate
17beta-estradiol (E2)
Meas. Tech.
Estrogen Receptor Binding Assay and Ishikawa Assay
pH
7.5±n/a
Temperature
295.15±n/a K
Ki
1.15±0.44 nM
EC50
4.78±3.22 nM
Citation
 Hummel, CWGeiser, AGBryant, HUCohen, IRDally, RDFong, KCFrank, SAHinklin, RJones, SALewis, GMcCann, DJRudmann, DGShepherd, TATian, HWallace, OBWang, MWang, YDodge, JA A selective estrogen receptor modulator designed for the treatment of uterine leiomyoma with unique tissue specificity for uterus and ovaries in rats. J Med Chem 48:6772-5 (2005)  
Target
Name:
Estrogen receptor
Synonyms:
ER ESR ESR1_HUMAN Estrogen receptor Estrogen receptor (ER-alpha) Estrogen receptor alpha (ER) Nuclear receptor subfamily 3 group A member 1
Type:
Protein
Mol. Mass.:
66230.44
Organism:
Homo sapiens (Human)
Description:
P03372
Residue:
595
  
Inhibitor
Name:
BDBM19965
Synonyms:
6-(4-methanesulfonylphenyl)-5-({4-[2-(piperidin-1-yl)ethoxy]phenyl}methyl)naphthalen-2-ol | LY2066948 analogue, 9
Type:
Small organic molecule
Emp. Form.:
C31H33NO4S
Mol. Mass.:
515.663
SMILES:
CS(=O)(=O)c1ccc(cc1)-c1ccc2cc(O)ccc2c1Cc1ccc(OCCN2CCCCC2)cc1
:
Substrate
Name:
BDBM17292
Synonyms:
(1S,10R,11S,14S,15S)-15-methyltetracyclo[8.7.0.0^{2,7}.0^{11,15}]heptadeca-2,4,6-triene-5,14-diol 17α-ethinylestradiol CHEMBL135 ESTRADIOL Ovocyclin US9040509, E2 US9561238, E2 [2,4,6,7-3H]-E2 [3H]]estradiol
Type:
Steroid
Emp. Form.:
C18H24O2
Mol. Mass.:
272.382
SMILES:
[H][C@@]12CC[C@H](O)[C@@]1(C)CC[C@]1([H])c3ccc(O)cc3CC[C@@]21[H]
: