Target
Estrogen receptor
Ligand
BDBM19968
Substrate
17beta-estradiol (E2)
Meas. Tech.
Estrogen Receptor Binding Assay and Cell-Based Transcriptional Assay
pH
7.5±n/a
Temperature
295.15±n/a K
Ki
2.68±0.21 nM
EC50
19.4±1.13 nM
Comments
Efficacy=94%
Citation
 Norman, BHDodge, JARichardson, TIBorromeo, PSLugar, CWJones, SAChen, KWang, YDurst, GLBarr, RJMontrose-Rafizadeh, COsborne, HEAmos, RMGuo, SBoodhoo, AKrishnan, V Benzopyrans are selective estrogen receptor beta agonists with novel activity in models of benign prostatic hyperplasia. J Med Chem 49:6155-7 (2006)  
Target
Name:
Estrogen receptor
Synonyms:
ER ESR ESR1_HUMAN Estrogen receptor Estrogen receptor (ER-alpha) Estrogen receptor alpha (ER) Nuclear receptor subfamily 3 group A member 1
Type:
Protein
Mol. Mass.:
66230.44
Organism:
Homo sapiens (Human)
Description:
P03372
Residue:
595
  
Inhibitor
Name:
BDBM19968
Synonyms:
(2R,6S,7R)-7-(4-hydroxyphenyl)-8-oxatricyclo[7.4.0.0^{2,6}]trideca-1(13),9,11-trien-12-ol Benzopyran derivative., 4b(racemate) racemic mixture
Type:
Small organic molecule
Emp. Form.:
C18H18O3
Mol. Mass.:
282.3337
SMILES:
Oc1ccc(cc1)[C@@H]1Oc2ccc(O)cc2[C@@H]2CCC[C@H]12
:
Substrate
Name:
BDBM17292
Synonyms:
(1S,10R,11S,14S,15S)-15-methyltetracyclo[8.7.0.0^{2,7}.0^{11,15}]heptadeca-2,4,6-triene-5,14-diol 17α-ethinylestradiol CHEMBL135 ESTRADIOL Ovocyclin US9040509, E2 US9561238, E2 [2,4,6,7-3H]-E2 [3H]]estradiol
Type:
Steroid
Emp. Form.:
C18H24O2
Mol. Mass.:
272.382
SMILES:
[H][C@@]12CC[C@H](O)[C@@]1(C)CC[C@]1([H])c3ccc(O)cc3CC[C@@]21[H]
: