Target
Estrogen receptor beta
Ligand
BDBM19989
Substrate
17beta-estradiol (E2)
Meas. Tech.
Estrogen Receptor Binding Assay.
pH
7.5±n/a
Temperature
295.15±n/a K
Ki
5.97±n/a nM
Citation
 Norman, BHRichardson, TIDodge, JAPfeifer, LADurst, GLWang, YDurbin, JDKrishnan, VDinn, SRLiu, SReilly, JERyter, KT Benzopyrans as selective estrogen receptor beta agonists (SERBAs). Part 4: functionalization of the benzopyran A-ring. Bioorg Med Chem Lett 17:5082-5 (2007)  
Target
Name:
Estrogen receptor beta
Synonyms:
ER-beta ESR2_HUMAN Estradiol receptor beta (ERβ) Estrogen receptor (ER beta) Estrogen receptor beta (ER beta) NR3A2 estrogen beta
Type:
Protein
Mol. Mass.:
59238.43
Organism:
Homo sapiens (Human)
Description:
Q92731
Residue:
530
  
Inhibitor
Name:
BDBM19989
Synonyms:
(2R,6S,7R)-10-(hydroxymethyl)-7-(4-hydroxyphenyl)-8-oxatricyclo[7.4.0.0^{2,6}]trideca-1(9),10,12-trien-12-ol | A-ring modified benzopyran scaffold, 2d
Type:
Small organic molecule
Emp. Form.:
C19H20O4
Mol. Mass.:
312.3597
SMILES:
OCc1cc(O)cc2[C@@H]3CCC[C@@H]3[C@@H](Oc12)c1ccc(O)cc1
:
Substrate
Name:
BDBM17292
Synonyms:
(1S,10R,11S,14S,15S)-15-methyltetracyclo[8.7.0.0^{2,7}.0^{11,15}]heptadeca-2,4,6-triene-5,14-diol 17α-ethinylestradiol CHEMBL135 ESTRADIOL Ovocyclin US9040509, E2 US9561238, E2 [2,4,6,7-3H]-E2 [3H]]estradiol
Type:
Steroid
Emp. Form.:
C18H24O2
Mol. Mass.:
272.382
SMILES:
[H][C@@]12CC[C@H](O)[C@@]1(C)CC[C@]1([H])c3ccc(O)cc3CC[C@@]21[H]
: