Target
Methionine aminopeptidase 2
Ligand
BDBM364249
Substrate
Meas. Tech.
Enzyme Assay
IC50
12.0±n/a nM
Citation
 Guillo, NMartin, V Pyrazolonaphthyridinone derivatives as MetAP2 inhibitors (methionine aminopeptidase type-2) US Patent  US9856257 Publication Date 1/2/2018 
Target
Name:
Methionine aminopeptidase 2
Synonyms:
Initiation factor 2-associated 67 kDa glycoprotein MAP2_HUMAN MNPEP Methionine aminopeptidase 2 (MetAP2) P67EIF2 p67
Type:
Enzyme
Mol. Mass.:
52884.45
Organism:
Homo sapiens (Human)
Description:
P50579
Residue:
478
  
Inhibitor
Name:
BDBM364249
Synonyms:
US9856257, 34
Type:
Small organic molecule
Emp. Form.:
C21H20F3N7O
Mol. Mass.:
443.425
SMILES:
FC(F)(F)Cn1c2cc(ncc2c2[nH]ncc2c1=O)-c1cccnc1N1CCCNCC1
: