Target
Methionine aminopeptidase 2
Ligand
BDBM364276
Substrate
Meas. Tech.
Enzyme Assay
IC50
37.0±n/a nM
Citation
 Guillo, NMartin, V Pyrazolonaphthyridinone derivatives as MetAP2 inhibitors (methionine aminopeptidase type-2) US Patent  US9856257 Publication Date 1/2/2018 
Target
Name:
Methionine aminopeptidase 2
Synonyms:
Initiation factor 2-associated 67 kDa glycoprotein MAP2_HUMAN MNPEP Methionine aminopeptidase 2 (MetAP2) P67EIF2 p67
Type:
Enzyme
Mol. Mass.:
52884.45
Organism:
Homo sapiens (Human)
Description:
P50579
Residue:
478
  
Inhibitor
Name:
BDBM364276
Synonyms:
US9856257, 61
Type:
Small organic molecule
Emp. Form.:
C16H11F3N6O
Mol. Mass.:
360.2933
SMILES:
Nc1cnccc1-c1cnc2c3[nH]ncc3c(=O)n(CC(F)(F)F)c2c1
: